{"text_format":"1","workbook":"xlsx","n_sheets":9,"sheets":["Template Instructions","Option 1","Option 2","Option 3","Executive Dashboard | Lifetime","Executive Dashboard | Projected","Executive Dashboard | Current","Formulas","Reference Formulas"],"not_rendered":{"charts":15,"images":0,"macros":1,"external_links":0,"defined_names":0,"comments":0,"pivot_tables":0},"unopened":[],"bounds":{"document_bytes":16777216,"sheet_cells":100000,"rows_first":2000,"rows_last":500,"rows_between":2000,"halvings":0,"cell_chars":16384,"cell_head_chars":4096},"cells_cut":0,"cells_raw":0,"read":"whole","date_system":"1900"}

{"sheet":"Template Instructions","index":0,"n_rows":28,"n_cols":13,"rows_kept":28,"cut":false,"hidden":false,"merged":[[21,2,21,3],[21,5,21,6],[22,2,22,3],[24,2,24,6],[27,0,28,19],[13,2,13,3],[14,2,14,3],[18,5,18,6],[19,5,19,6],[20,2,20,3],[20,5,20,6],[15,2,15,3],[15,5,15,6],[16,2,16,3],[16,5,16,6],[17,2,17,3],[17,5,17,6],[19,2,19,3],[16,11,16,16],[17,11,17,16],[2,2,2,17],[4,2,4,17],[8,2,8,6],[8,11,8,17],[9,12,9,16],[10,5,10,6],[10,12,10,16],[13,5,13,6],[14,5,14,6],[10,2,10,3],[11,2,11,3],[11,5,11,6],[12,2,12,3],[12,5,12,6],[9,10,9,11],[10,10,10,11],[11,10,11,11],[11,12,11,16],[13,11,14,16]]}
[]
[]
[null,null,"This Total Cost of Ownership (TCO) calculator is designed to help you understand, compare, and communicate the total cost (which includes both the direct and indirect costs) of up to three items. You might want to compare a new tool or solution to an existing one, compare multiple new technologies you are evaluating, or review and assess your various approaches to how you manage your IT environment. No matter what the scope of your assessment is, this calculator can help you look into the past and present, helping you compute and share future costs in a comprehensive, holistic way."]
[]
[null,null,"This calculator is best used within Microsoft Excel; the formulas and dashboards are most congruent with this platform. Should you decide to use alternative spreadsheet programs you may find certain graphs and charts do not render correctly."]
[]
[]
[]
[null,null,"To get started, fill in the cells below",null,null,null,null,null,null,null,null,"To use this calculator, follow these steps:"]
[null,null,null,null,null,null,null,null,null,null,1,null,"Go to the tab labeled OPTION 1: to begin your assessment of the first item."]
{"$rows_left_out":19}
{"sheet":"Option 1","index":1,"n_rows":159,"n_cols":19,"rows_kept":159,"cut":false,"hidden":false,"merged":[[0,2,0,5],[0,6,0,8],[0,9,0,17],[158,2,159,18]]}
[{"$f":"'Template Instructions'!F17","v":"Existing Infrastructure"},{"$f":"'Reference Formulas'!Q6","v":12485391},"BE ADVISED\nInputs should be placed into shaded cells only; cells in white and hidden rows contain calculations and formulas. Tampering or adjusting these cells and rows can break functionality and usability throughout the calculator.",null,null,null,"For Past/YTD",null,null,"For Future Projections",null,null,null,null,null,null,null,null,"Lifetime"]
["Item Category","Item","Notes","Cost Per Unit","Quantity","Total Initial Cost","What is the Recurring Cost?","Years Owned / Recurred","YTD TCO","Is this a Future Recurring Cost?","Future Yearly Recurring Cost","Future Cost (Recurring)","Ad Hoc Additions","Year to Add","Future Cost (Ad Hoc)","EOL Cost","EOL Gain","Projected TCO","Item TCO"]
["Infrastructure Equipment",null,null,{"$f":"SUM($D4:$D28)","v":35850},null,{"$f":"SUM(F$4:F$28)","v":220750},null,null,{"$f":"SUM($I4:$I28)","v":238350},null,null,{"$f":"SUM($L4:$L28)","v":24409},null,null,{"$f":"SUM($O4:$O28)","v":169483.02077989775},null,null,{"$f":"SUM($R4:$R28)","v":193892},{"$f":"SUM($S4:$S28)","v":432242}]
[null,null,null,null,null,{"$f":"ROUND($D4:$D28*$E4:$E28,0)","v":0},null,null,{"$f":"ROUND(IF($G4:$G28>0,($G4:$G28*($H4:$H28-1)+$F4:$F28),$F4:$F28),0)","v":0},null,null,{"$f":"ROUND(IF($J4:$J28=\"no\",0,(($K4:$K28*'Template Instructions'!$F$20)*(1+'Template Instructions'!$F$16)^'Template Instructions'!$F$20*'Template Instructions'!$F$15)),0)","v":0},null,null,{"$f":"ROUND($M4:$M28*$D4:$D28,0)*(1+'Template Instructions'!$F$16)^($N4:$N28)","v":0},null,null,{"$f":"ROUND($L4:$L28+$O4:$O28+$Q4:$Q28-$P4:$P28,0)","v":0},{"$f":"ROUND($I4:$I28+$R4:$R28,0)","v":0}]
["Servers","Servers","Will need update in 2027 (year 5)",5000,10,50000,null,5,50000,"No",null,0,10,5,55475.179324455014,null,null,55475,105475]
["Servers","Server software","Software + licensing",8750,1,8750,null,5,8750,"No",null,0,0,0,0,null,null,0,8750]
["Servers","Server rack ",null,1000,1,1000,null,5,1000,"No",null,0,0,0,0,null,null,0,1000]
["Networking Equipment","Switches",null,6000,12,72000,null,5,72000,"No",null,0,6,5,39942.129113607611,null,null,39942,111942]
["Networking Equipment","Access points",null,500,18,9000,null,5,9000,"No",null,0,12,3,6385.9935659999983,null,null,6386,15386]
["Networking Equipment","Firewalls","Next-generation firewall with VPN",2500,4,10000,null,5,10000,"No",null,0,0,0,0,null,null,0,10000]
{"$rows_left_out":150}
{"sheet":"Option 2","index":2,"n_rows":159,"n_cols":19,"rows_kept":159,"cut":false,"hidden":false,"merged":[[0,2,0,5],[0,6,0,8],[0,9,0,17],[158,2,159,18]]}
[{"$f":"'Template Instructions'!F18","v":"Cloud Alternative"},{"$f":"'Reference Formulas'!Q7","v":5529438},"BE ADVISED\nInputs should be placed into shaded cells only; cells in white and hidden rows contain calculations and formulas. Tampering or adjusting these cells and rows can break functionality and usability throughout the calculator.",null,null,null,"For Past/YTD",null,null,"For Future Projections",null,null,null,null,null,null,null,null,"Lifetime"]
["Item Category","Item","Notes","Cost Per Unit","Quantity","Total Initial Cost","What is the Recurring Cost?","Years Owned / Recurred","YTD TCO","Is this a Future Recurring Cost?","Future Yearly Recurring Cost","Future Cost (Recurring)","Ad Hoc Additions","Year to Add","Future Cost (Ad Hoc)","EOL Cost","EOL Gain","Projected TCO","Item TCO"]
["Infrastructure Equipment",null,null,{"$f":"SUM($D4:$D28)","v":9000},null,{"$f":"SUM(F$4:F$28)","v":28000},null,null,{"$f":"SUM($I4:$I28)","v":45600},null,null,{"$f":"SUM($L4:$L28)","v":24409},null,null,{"$f":"SUM($O4:$O28)","v":3192.9967829999991},null,null,{"$f":"SUM($R4:$R28)","v":27602},{"$f":"SUM($S4:$S28)","v":73202}]
[null,null,null,null,null,{"$f":"ROUND($D4:$D28*$E4:$E28,0)","v":0},null,null,{"$f":"ROUND(IF($G4:$G28>0,($G4:$G28*($H4:$H28-1)+$F4:$F28),$F4:$F28),0)","v":0},null,null,{"$f":"ROUND(IF($J4:$J28=\"no\",0,(($K4:$K28*'Template Instructions'!$F$20)*(1+'Template Instructions'!$F$16)^'Template Instructions'!$F$20*'Template Instructions'!$F$15)),0)","v":0},null,null,{"$f":"ROUND($M4:$M28*$D4:$D28,0)*(1+'Template Instructions'!$F$16)^($N4:$N28)","v":0},null,null,{"$f":"ROUND($L4:$L28+$O4:$O28+$Q4:$Q28-$P4:$P28,0)","v":0},{"$f":"ROUND($I4:$I28+$R4:$R28,0)","v":0}]
["Servers","Servers","No longer needed",0,0,0,0,0,0,"No",null,0,0,0,0,null,null,0,0]
["Software and Licensing","Server software","No longer needed",0,0,0,0,0,0,"No",null,0,0,0,0,null,null,0,0]
["Servers","Server rack ","No longer needed",0,0,0,0,0,0,"No",null,0,0,0,0,null,null,0,0]
["Networking Equipment","Switches","No longer needed",0,0,0,0,0,0,"No",null,0,0,0,0,null,null,0,0]
["Networking Equipment","Access points",null,500,18,9000,0,5,9000,"No",null,0,6,3,3192.9967829999991,null,null,3193,12193]
["Networking Equipment","Firewalls","Next-generation firewall with VPN",2500,4,10000,0,5,10000,"No",null,0,0,0,0,null,null,0,10000]
{"$rows_left_out":150}
{"sheet":"Option 3","index":3,"n_rows":159,"n_cols":19,"rows_kept":159,"cut":false,"hidden":false,"merged":[[0,2,0,5],[0,6,0,8],[0,9,0,17],[158,2,159,18]]}
[{"$f":"'Template Instructions'!F19","v":0},{"$f":"'Reference Formulas'!Q10","v":3093103},"BE ADVISED\nShaded cells are meant for your direct input; cells in white contain predetermined calculations and formulas. Tampering or adjusting cells in white can break functionality and usability throughout the calculator.",null,null,null,"For Past/YTD",null,null,"For Future Projections",null,null,null,null,null,null,null,null,"Lifetime"]
["Item Category","Item","Notes","Cost Per Unit","Quantity","Total Initial Cost","What is the Recurring Cost?","Years Owned / Recurred","YTD TCO","Is this a Future Recurring Cost?","Future Yearly Recurring Cost","Future Cost (Recurring)","Ad Hoc Additions","Year to Add","Future Cost \n(Ad Hoc)","EOL Cost","EOL Gain","Projected TCO","Item TCO"]
["Infrastructure Equipment",null,null,{"$f":"SUM($D4:$D15)","v":0},null,{"$f":"SUM(F$4:F$15)","v":0},null,null,{"$f":"SUM($I4:$I15)","v":0},null,null,{"$f":"SUM($L4:$L15)","v":0},null,null,{"$f":"SUM($O4:$O15)","v":0},null,null,{"$f":"SUM($R4:$R15)","v":0},{"$f":"SUM($S4:$S15)","v":0}]
[null,null,null,null,null,{"$f":"ROUND($D4:$D27*$E4:$E27,0)","v":0},null,null,{"$f":"ROUND(IF($G4:$G28>0,($G4:$G28*($H4:$H28-1)+$F4:$F28),$F4:$F28),0)","v":0},null,null,{"$f":"ROUND(IF($J4:$J28=\"no\",0,(($K4:$K28*'Template Instructions'!$F$20)*(1+'Template Instructions'!$F$16)^'Template Instructions'!$F$20*'Template Instructions'!$F$15)),0)","v":0},null,null,{"$f":"ROUND($M4:$M28*$D4:$D28,0)*(1+'Template Instructions'!$F$16)^($N4:$N28)","v":0},null,null,{"$f":"ROUND($L4:$L28+$O4:$O28+$Q4:$Q28-$P4:$P28,0)","v":0},{"$f":"ROUND($I4:$I28+$R4:$R28,0)","v":0}]
[null,null,null,null,null,0,null,null,0,null,null,0,null,null,0,null,null,0,0]
[null,null,null,null,null,0,null,null,0,null,null,0,null,null,0,null,null,0,0]
[null,null,null,null,null,0,null,null,0,null,null,0,null,null,0,null,null,0,0]
[null,null,null,null,null,0,null,null,0,null,null,0,null,null,0,null,null,0,0]
[null,null,null,null,null,0,null,null,0,null,null,0,null,null,0,null,null,0,0]
[null,null,null,null,null,0,null,null,0,null,null,0,null,null,0,null,null,0,0]
{"$rows_left_out":150}
{"sheet":"Executive Dashboard | Lifetime","index":4,"n_rows":34,"n_cols":45,"rows_kept":34,"cut":false,"hidden":false,"merged":[[8,11,14,11],[19,11,26,11],[19,12,26,12],[19,13,26,13],[8,3,26,3],[8,4,26,4],[8,5,26,5],[8,12,14,12],[8,13,14,13],[18,11,18,13],[16,40,17,44],[18,24,18,26],[18,37,18,39],[8,25,14,25],[8,26,14,26],[8,37,14,37],[8,38,14,38],[8,39,14,39],[9,27,9,31],[9,40,9,44],[8,24,14,24],[7,24,7,26],[7,37,7,39],[9,14,9,18],[16,14,17,18],[16,27,17,31],[2,1,2,20],[3,1,3,20],[6,3,6,4],[7,3,7,5],[7,11,7,13],[20,40,20,44],[27,40,28,44],[28,14,29,18],[28,27,29,31],[33,0,34,47],[19,24,26,24],[19,25,26,25],[19,26,26,26],[19,37,25,37],[19,38,25,38],[19,39,25,39],[20,27,20,31],[20,14,20,18]]}
[null,"Total Cost of Ownership Analysis | Executive Summary"]
[]
[null,{"$f":"'Reference Formulas'!Q26","v":"Lifetime Total Cost of Ownership Comparison: Existing Infrastructure vs Cloud Alternative"}]
[null,"Lifetime TCO includes both YTD and future costs. It reflects all the past and future expenses associated with a given solution over a period of time."]
[]
[]
[]
[null,null,null,"Overall Total Cost of Ownership",null,null,null,null,null,null,null,{"$f":"'Reference Formulas'!A6","v":"Infrastructure Equipment"},null,null,null,null,null,null,null,null,null,null,null,null,{"$f":"'Reference Formulas'!A8","v":"Software and Applications"},null,null,null,null,null,null,null,null,null,null,null,null,{"$f":"'Reference Formulas'!$A$10","v":"Personnel and Support"}]
[]
[]
{"$rows_left_out":25}
{"sheet":"Executive Dashboard | Projected","index":5,"n_rows":34,"n_cols":45,"rows_kept":34,"cut":false,"hidden":false,"merged":[[33,0,34,48],[9,3,26,3],[9,4,26,4],[9,5,26,5],[19,11,26,11],[19,12,26,12],[19,13,26,13],[19,24,26,24],[28,14,29,18],[8,26,14,26],[8,37,14,37],[19,25,26,25],[19,26,26,26],[20,27,20,31],[8,11,14,11],[8,12,14,12],[8,13,14,13],[8,24,14,24],[8,25,14,25],[27,40,28,44],[16,14,17,18],[16,27,17,31],[16,40,17,44],[18,11,18,13],[18,24,18,26],[18,37,18,39],[28,27,29,31],[7,37,7,39],[8,38,14,38],[8,39,14,39],[19,37,26,37],[19,38,26,38],[19,39,26,39],[2,1,2,21],[3,1,3,27],[6,4,6,5],[7,3,7,5],[7,11,7,13],[7,24,7,26]]}
[null,"Total Cost of Ownership Comparison | Executive Summary"]
[]
[null,{"$f":"'Reference Formulas'!Q27","v":"Projected Total Cost of Ownership Comparison: Existing Infrastructure vs Cloud Alternative"}]
[null,"Future projection costs estimate how much a solution will cost within a given time period that you've chosen. Future costs are ideal for proposed solutions, because they do not have associated past costs."]
[]
[]
[]
[null,null,null,"Overall Total Cost of Ownership",null,null,null,null,null,null,null,{"$f":"'Reference Formulas'!A6","v":"Infrastructure Equipment"},null,null,null,null,null,null,null,null,null,null,null,null,{"$f":"'Reference Formulas'!A8","v":"Software and Applications"},null,null,null,null,null,null,null,null,null,null,null,null,{"$f":"'Reference Formulas'!A10","v":"Personnel and Support"}]
[]
[]
{"$rows_left_out":25}
{"sheet":"Executive Dashboard | Current","index":6,"n_rows":37,"n_cols":11,"rows_kept":37,"cut":false,"hidden":false,"merged":[[10,2,29,3],[33,2,33,3],[36,0,37,12],[0,0,0,12],[2,1,2,11],[3,1,3,11],[6,2,6,3],[8,2,8,3],[8,8,8,9]]}
["Total Cost of Ownership Analysis | Executive Summary"]
[]
[null,{"$f":"CONCATENATE(\"Year-to-Date (YTD) Total Cost of Ownership Overview: \" & 'Reference Formulas'!$C$6)","v":"Year-to-Date (YTD) Total Cost of Ownership Overview: Existing Infrastructure"}]
[null,"Year-to-date, or current, TCO reflects the costs you've already paid for an existing solution. This analysis is meant to organize and review the total cost of ownership of your existing solution to better understand where effciencies may be gained."]
[]
[]
[null,null,{"$f":"'Reference Formulas'!Q24","v":"Total Cost of Ownership: Existing Infrastructure"}]
[]
[null,null,{"$f":"'Reference Formulas'!Q9","v":7665885},null,null,null,null,null,"Category Breakdown"]
[]
{"$rows_left_out":28}
{"sheet":"Formulas","index":7,"n_rows":34,"n_cols":4,"rows_kept":34,"cut":false,"hidden":false,"merged":[[33,0,34,7]]}
["Compound Inflation Calculator (In)"]
["Formula","FV = PV(1+r)^n"]
["# years (n)",5]
["rate of inflation (r)",2.1000000000000001E-2,"(The average inflation in the U.S. over the last 10 years was 2.1%, but is currently higher.)"]
["Present value (PV)",6000]
["Future Value (FV) =",{"$f":"B5*(1+B4)^B3","v":6657.0215189346018}]
[]
["To calculate compound raises, change the rate of inflation to the projected salary raise per year."]
[]
["Labor Costs per Worker (L)"]
{"$rows_left_out":25}
{"sheet":"Reference Formulas","index":8,"n_rows":31,"n_cols":31,"rows_kept":31,"cut":false,"hidden":true,"merged":[[0,0,0,17],[4,1,4,2]]}
["This is the master reference sheet, to be used by dashboards throughout the calculator. See color coding table to determine references and in-sheet calculations. \n\nDO NOT MOVE ANY PRE-EXISTING VALUES UNLESS YOU PLAN TO ADJUST THE REFERENCES. Other tabs will use absolute references to this sheet. As needed add values below (if adding to a list) or create a new list to the right.\n\n© 2022 JumpCloud Inc. All rights reserved.\n\nJUMPCLOUD EXPRESSLY DISCLAIMS ALL REPRESENTATIONS, WARRANTIES, OR CONDITIONS OF ANY KIND, EXPRESS OR IMPLIED, INCLUDING ANY AND ALL REPRESENTATIONS, WARRANTIES, OR CONDITIONS OF TITLE, NON-INFRINGEMENT, MERCHANTABILITY, FITNESS FOR A PARTICULAR PURPOSE, ACCURACY, CONTINUOUS OR ERROR-FREE OPERATION FROM OR RELATING TO THIS CALCULATOR."]
["Yes","Color Codes:","Reference","In-sheet calculation"]
["No",null,null,null,null,null,null,null,null,null,null,null,null,null,null,null,null,null,null,null,null,null,null,null,null,null,"Lifetime",null,null,"Projected"]
[null,null,null,null,"Option 1","Option 2","Option 3",null,"Option 1","Option 2","Option 3",null,"Option 1","Option 2","Option 3",null,null,null,null,null,null,null,null,null,null,"Option 1","Option 2","Option 3"]
["Categories for master template and dashboard summaries","TCO Analysis | Names of things being compared",null,"Lifetime TCO Totals:",{"$f":"$C$6","v":"Existing Infrastructure"},{"$f":"$C$7","v":"Cloud Alternative"},{"$f":"$C$8","v":0},"Past/YTD TCO Totals:",{"$f":"$C$6","v":"Existing Infrastructure"},{"$f":"$C$7","v":"Cloud Alternative"},{"$f":"$C$8","v":0},"Future TCO Totals:",{"$f":"$C$6","v":"Existing Infrastructure"},{"$f":"$C$7","v":"Cloud Alternative"},{"$f":"$C$8","v":0},"TCO Dashboard Calculations",null,"Data Validation for Template Instructions Workplace Environment","Infrastructure Equipment","Data Center and Hosting Costs","Software and Applications","Employee Devices and Hardware","Personnel and Support","Rollout","SUMIF formulas for subcategories | Lifetime TCO",{"$f":"$C$6","v":"Existing Infrastructure"},{"$f":"$C$7","v":"Cloud Alternative"},{"$f":"$C$8","v":0},{"$f":"$C$6","v":"Existing Infrastructure"},{"$f":"$C$7","v":"Cloud Alternative"},{"$f":"$C$8","v":0}]
["Infrastructure Equipment","Option 1",{"$f":"'Template Instructions'!$F$17","v":"Existing Infrastructure"},{"$f":"$A$6","v":"Infrastructure Equipment"},{"$f":"'Option 1'!$S$3","v":432242},{"$f":"'Option 2'!$S$3","v":73202},{"$f":"'Option 3'!$S$3","v":0},{"$f":"$A$6","v":"Infrastructure Equipment"},{"$f":"'Option 1'!$I$3","v":238350},{"$f":"'Option 2'!$I$3","v":45600},{"$f":"'Option 3'!$I$3","v":0},{"$f":"$A$6","v":"Infrastructure Equipment"},{"$f":"'Option 1'!$R$3","v":193892},{"$f":"'Option 2'!$R$3","v":27602},{"$f":"'Option 3'!$R$3","v":0},"Lifetime | Total Cost Chart | Option 1 | Total Cost Summation",{"$f":"SUM($E$6:$E$11)","v":12485391},"Fully Remote","Servers","Rent/Mortgage","IT Solutions","Laptops","Salaries","Installation & Setup","Servers",{"$f":"SUMIF('Option 1'!$A$4:$A$28,$Y$6,'Option 1'!$S$4:$S$28)","v":115225},{"$f":"SUMIF('Option 2'!$A$4:$A$28,$Y$6,'Option 2'!$S$4:$S$28)","v":0},{"$f":"SUMIF('Option 3'!$A$4:$A$15,$Y$6,'Option 3'!$S$4:$S$15)","v":0},{"$f":"SUMIF('Option 1'!$A$4:$A$28,$Y$6,'Option 1'!$R$4:$R$28)","v":55475},{"$f":"SUMIF('Option 2'!$A$4:$A$28,$Y$6,'Option 2'!$R$4:$R$28)","v":0},{"$f":"SUMIF('Option 3'!$A$4:$A$15,$Y$6,'Option 3'!$R$4:$R$15)","v":0}]
["Data Center and Hosting Costs","Option 2",{"$f":"'Template Instructions'!$F$18","v":"Cloud Alternative"},{"$f":"$A$7","v":"Data Center and Hosting Costs"},{"$f":"'Option 1'!$S$29","v":865337},{"$f":"'Option 2'!$S$29","v":0},{"$f":"'Option 3'!$S$29","v":0},{"$f":"$A$7","v":"Data Center and Hosting Costs"},{"$f":"'Option 1'!$I$29","v":587740},{"$f":"'Option 2'!$I$29","v":0},{"$f":"'Option 3'!$I$29","v":0},{"$f":"$A$7","v":"Data Center and Hosting Costs"},{"$f":"'Option 1'!$R$29","v":277597},{"$f":"'Option 2'!$R$29","v":0},{"$f":"'Option 3'!$R$29","v":0},"Lifetime | Total Cost Chart | Option 2 | Total Cost Summation",{"$f":"SUM($F$6:$F$11)","v":5529438},"Mostly Remote","Networking Equipment","Insurance","SaaS Solutions","Smartphones","Consulting Services","Professional Services","Networking Equipment",{"$f":"SUMIF('Option 1'!$A$4:$A$28,$Y$7,'Option 1'!$S$4:$S$28)","v":188337},{"$f":"SUMIF('Option 2'!$A$4:$A$28,$Y$7,'Option 2'!$S$4:$S$28)","v":73202},{"$f":"SUMIF('Option 3'!$A$4:$A$15,$Y$7,'Option 3'!$S$4:$S$15)","v":0},{"$f":"SUMIF('Option 1'!$A$4:$A$28,$Y$7,'Option 1'!$R$4:$R$28)","v":70737},{"$f":"SUMIF('Option 2'!$A$4:$A$28,$Y$7,'Option 2'!$R$4:$R$28)","v":27602},{"$f":"SUMIF('Option 3'!$A$4:$A$15,$Y$7,'Option 3'!$R$4:$R$15)","v":0}]
["Software and Applications","Option 3",{"$f":"'Template Instructions'!$F$19","v":0},{"$f":"$A$8","v":"Software and Applications"},{"$f":"'Option 1'!$S$55","v":2579591},{"$f":"'Option 2'!$S$55","v":1228816},{"$f":"'Option 3'!$S$55","v":0},{"$f":"$A$8","v":"Software and Applications"},{"$f":"'Option 1'!$I$55","v":1275480},{"$f":"'Option 2'!$I$55","v":540480},{"$f":"'Option 3'!$I$55","v":0},{"$f":"$A$8","v":"Software and Applications"},{"$f":"'Option 1'!$R$55","v":1304111},{"$f":"'Option 2'!$R$55","v":688336},{"$f":"'Option 3'!$R$55","v":0},"Lifetime | Total Cost Chart | Option 3 | Total Cost Summation",{"$f":"SUM($G$6:$G$11)","v":0},"Hybrid","Software and Licensing","Utilities","Business Software","Data plans","Professional Development","Training","Software and Licensing",{"$f":"SUMIF('Option 1'!$A$4:$A$28,$Y$8,'Option 1'!$S$4:$S$28)","v":128680},{"$f":"SUMIF('Option 2'!$A$4:$A$28,$Y$8,'Option 2'!$S$4:$S$28)","v":0},{"$f":"SUMIF('Option 3'!$A$4:$A$15,$Y$8,'Option 3'!$S$4:$S$15)","v":0},{"$f":"SUMIF('Option 1'!$A$4:$A$28,$Y$8,'Option 1'!$R$4:$R$28)","v":67680},{"$f":"SUMIF('Option 2'!$A$4:$A$28,$Y$8,'Option 2'!$R$4:$R$28)","v":0},{"$f":"SUMIF('Option 3'!$A$4:$A$15,$Y$8,'Option 3'!$R$4:$R$15)","v":0}]
["Employee Devices and Hardware",null,null,{"$f":"$A$9","v":"Employee Devices and Hardware"},{"$f":"'Option 1'!$S$81","v":660580},{"$f":"'Option 2'!$S$81","v":664603},{"$f":"'Option 3'!$S$81","v":0},{"$f":"$A$9","v":"Employee Devices and Hardware"},{"$f":"'Option 1'!$I$81","v":365100},{"$f":"'Option 2'!$I$81","v":365100},{"$f":"'Option 3'!$I$81","v":0},{"$f":"$A$9","v":"Employee Devices and Hardware"},{"$f":"'Option 1'!$R$81","v":295480},{"$f":"'Option 2'!$R$81","v":299503},{"$f":"'Option 3'!$R$81","v":0},"Past | Total Cost Chart | Option 1 | Total Cost Summation",{"$f":"SUM($I$6:$I$11)","v":7665885},"Mostly In Office","Misc. Infrastructure","Security","Misc. Applications","Peripherals","Misc. Personnel","Misc. Rollout","Misc. Infrastructure",{"$f":"SUMIF('Option 1'!$A$4:$A$28,$Y$9,'Option 1'!$S$4:$S$28)","v":0},{"$f":"SUMIF('Option 2'!$A$4:$A$28,$Y$9,'Option 2'!$S$4:$S$28)","v":0},{"$f":"SUMIF('Option 3'!$A$4:$A$15,$Y$9,'Option 3'!$S$4:$S$15)","v":0},{"$f":"SUMIF('Option 1'!$A$4:$A$28,$Y$9,'Option 1'!$R$4:$R$28)","v":0},{"$f":"SUMIF('Option 2'!$A$4:$A$28,$Y$9,'Option 2'!$R$4:$R$28)","v":0},{"$f":"SUMIF('Option 3'!$A$4:$A$15,$Y$9,'Option 3'!$R$4:$R$15)","v":0}]
["Personnel and Support",null,null,{"$f":"$A$10","v":"Personnel and Support"},{"$f":"'Option 1'!$S$107","v":7909379},{"$f":"'Option 2'!$S$107","v":3514880},{"$f":"'Option 3'!$S$107","v":0},{"$f":"$A$10","v":"Personnel and Support"},{"$f":"'Option 1'!$I$107","v":5180000},{"$f":"'Option 2'!$I$107","v":2128000},{"$f":"'Option 3'!$I$107","v":0},{"$f":"$A$10","v":"Personnel and Support"},{"$f":"'Option 1'!$R$107","v":2729379},{"$f":"'Option 2'!$R$107","v":1386880},{"$f":"'Option 3'!$R$107","v":0},"Past | Total Cost Chart | Option 2 | Total Cost Summation",{"$f":"SUM($J$6:$J$11)","v":3093103},"Fully In Office",null,"Misc. Data Center",null,"Misc. Hardware",null,null,"Rent/Mortgage",{"$f":"SUMIF('Option 1'!$A$30:$A$54,$Y$10,'Option 1'!$S$30:$S$54)","v":186570},{"$f":"SUMIF('Option 2'!$A$30:$A$41,$Y$10,'Option 2'!$S$30:$S$41)","v":0},{"$f":"SUMIF('Option 3'!$A$30:$A$54,$Y$10,'Option 3'!$S$30:$S$54)","v":0},{"$f":"SUMIF('Option 1'!$A$30:$A$54,$Y$10,'Option 1'!$R$30:$R$54)","v":66570},{"$f":"SUMIF('Option 2'!$A$30:$A$41,$Y$10,'Option 2'!$R$30:$R$41)","v":0},{"$f":"SUMIF('Option 3'!$A$30:$A$54,$Y$10,'Option 3'!$R$30:$R$54)","v":0}]
{"$rows_left_out":21}